Target
Intercellular adhesion molecule 1
Ligand
BDBM50105227
Substrate
Meas. Tech.
ChEMBL_89057 (CHEMBL698938)
IC50
1.4±n/a nM
Citation
 Zhu, GDArendsen, DLGunawardana, IWBoyd, SAStewart, AOFry, DGCool, BLKifle, LSchaefer, VMeuth, JMarsh, KCKempf-Grote, AJKilgannon, PGallatin, WMOkasinski, GF Selective inhibition of ICAM-1 and E-selectin expression in human endothelial cells. 2. Aryl modifications of 4-(aryloxy)thieno[2,3-c]pyridines with fine-tuning at C-2 carbamides. J Med Chem 44:3469-87 (2001)  
Target
Name:
Intercellular adhesion molecule 1
Synonyms:
CD_antigen=CD54 ICAM1 Intercellular adhesion molecule (ICAM-1), Integrin alpha-L/beta-2 Intercellular adhesion molecule-1 | Major group rhinovirus receptor
Type:
PROTEIN
Mol. Mass.:
57831.10
Organism:
Homo sapiens (Human)
Description:
ChEMBL_826675
Residue:
532
  
Inhibitor
Name:
BDBM50105227
Synonyms:
4-[4-(Tetrahydro-pyran-2-yloxymethyl)-phenoxy]-thieno[2,3-c]pyridine-2-carboxylic acid amide | CHEMBL118113
Type:
Small organic molecule
Emp. Form.:
C20H20N2O4S
Mol. Mass.:
384.449
SMILES:
NC(=O)c1cc2c(Oc3ccc(COC4CCCCO4)cc3)cncc2s1
: