Target
Mitogen-activated protein kinase 14
Ligand
BDBM15458
Substrate
Meas. Tech.
ChEBML_221157
IC50
19±n/a nM
Citation
 Adams, JLBoehm, JCGallagher, TFKassis, SWebb, EFHall, RSorenson, MGarigipati, RGriswold, DELee, JC Pyrimidinylimidazole inhibitors of p38: cyclic N-1 imidazole substituents enhance p38 kinase inhibition and oral activity. Bioorg Med Chem Lett 11:2867-70 (2001)  
Target
Name:
Mitogen-activated protein kinase 14
Synonyms:
CSAID-binding protein CSBP1 CSPB1 MAP kinase 14 MAP kinase p38 alpha MAPK14 MK14_HUMAN Mitogen-activated protein kinase p38 alpha Stress-activated protein kinase 2a | p38 MAP kinase alpha/beta
Type:
Serine/threonine-protein kinase
Mol. Mass.:
41286.76
Organism:
Homo sapiens (Human)
Description:
Q16539
Residue:
360
  
Inhibitor
Name:
BDBM15458
Synonyms:
4-[4-(4-fluorophenyl)-1-(piperidin-4-yl)-1H-imidazol-5-yl]-2-methoxypyrimidine CHEMBL95692 SB242235
Type:
Small organic molecule
Emp. Form.:
C19H20FN5O
Mol. Mass.:
353.3934
SMILES:
COc1nccc(n1)-c1c(ncn1C1CCNCC1)-c1ccc(F)cc1
: