Target
Aspartyl/asparaginyl beta-hydroxylase
Ligand
BDBM23223
Substrate
Meas. Tech.
ChEMBL_2018813 (CHEMBL4672391)
IC50
330±n/a nM
Citation
 Brewitz, LTumber, AZhang, XSchofield, CJ Small-molecule active pharmaceutical ingredients of approved cancer therapeutics inhibit human aspartate/asparagine-?-hydroxylase. Bioorg Med Chem 28:0 (2020)  
Target
Name:
Aspartyl/asparaginyl beta-hydroxylase
Synonyms:
1.14.11.16 ASPH Aspartate beta-hydroxylase BAH | Peptide-aspartate beta-dioxygenase
Type:
PROTEIN
Mol. Mass.:
85823.27
Organism:
Homo sapiens
Description:
ChEMBL_120098
Residue:
758
  
Inhibitor
Name:
BDBM23223
Synonyms:
7-[8-formyl-1,6,7-trihydroxy-3-methyl-5-(propan-2-yl)naphthalen-2-yl]-2,3,8-trihydroxy-6-methyl-4-(propan-2-yl)naphthalene-1-carbaldehyde Gossypol Gossypol, 4 Tash 1 cid_3503
Type:
Small organic molecule
Emp. Form.:
C30H30O8
Mol. Mass.:
518.5544
SMILES:
CC(C)c1c(O)c(O)c(C=O)c2c(O)c(c(C)cc12)-c1c(C)cc2c(C(C)C)c(O)c(O)c(C=O)c2c1O
: