Target
Muscarinic acetylcholine receptor M4
Ligand
BDBM50064176
Substrate
Meas. Tech.
ChEMBL_139119 (CHEMBL749857)
Ki
38±n/a nM
Citation
 Melchiorre, CBolognesi, MLBudriesi, RGhelardini, CChiarini, AMinarini, ARosini, MTumiatti, VWade, EJ Design, synthesis, and biological activity of methoctramine-related polyamines as putative G(i) protein activators. J Med Chem 44:4035-8 (2001)  
Target
Name:
Muscarinic acetylcholine receptor M4
Synonyms:
ACM4_HUMAN Cholinergic, muscarinic M4 Muscarinic acetylcholine receptor M2 and M4
Type:
Enzyme Catalytic Domain
Mol. Mass.:
53079.31
Organism:
Homo sapiens (Human)
Description:
Cholinergic, muscarinic M4 CHRM4 HUMAN M3::P08173
Residue:
479
  
Inhibitor
Name:
BDBM50064176
Synonyms:
CHEMBL27673 METHOCTRAMINE N1,N8-bis(6-(2-methoxybenzylamino)hexyl)octane-1,8-diamine
Type:
Small organic molecule
Emp. Form.:
C36H62N4O2
Mol. Mass.:
582.9031
SMILES:
COc1ccccc1CNCCCCCCNCCCCCCCCNCCCCCCNCc1ccccc1OC
: