Target
Transporter
Ligand
BDBM50106859
Substrate
Meas. Tech.
ChEBML_142968
Ki
260±n/a nM
Citation
 Gu, XHZong, RKula, NSBaldessarini, RJNeumeyer, JL Synthesis and biological evaluation of a series of novel N- or O-fluoroalkyl derivatives of tropane: potential positron emission tomography (PET) imaging agents for the dopamine transporter. Bioorg Med Chem Lett 11:3049-53 (2001)  
Target
Name:
Transporter
Synonyms:
Monoamine transporters; Norepininephrine & dopamine | Norepinephrine Monoamine transporters
Type:
PROTEIN
Mol. Mass.:
66787.87
Organism:
Rattus norvegicus
Description:
ChEMBL_1463061
Residue:
597
  
Inhibitor
Name:
BDBM50106859
Synonyms:
8-Methyl-3-p-tolyl-8-aza-bicyclo[3.2.1]octane-2-carboxylic acid 3-fluoro-propyl ester | CHEMBL430504
Type:
Small organic molecule
Emp. Form.:
C19H26FNO2
Mol. Mass.:
319.4136
SMILES:
CN1C2CCC1C(C(C2)c1ccc(C)cc1)C(=O)OCCCF
: