Target
Sodium-dependent serotonin transporter
Ligand
BDBM50106860
Substrate
Meas. Tech.
ChEBML_201799
Ki
13±n/a nM
Citation
 Gu, XHZong, RKula, NSBaldessarini, RJNeumeyer, JL Synthesis and biological evaluation of a series of novel N- or O-fluoroalkyl derivatives of tropane: potential positron emission tomography (PET) imaging agents for the dopamine transporter. Bioorg Med Chem Lett 11:3049-53 (2001)  
Target
Name:
Sodium-dependent serotonin transporter
Synonyms:
5-HT Transporter 5HT transporter Anandamid membrane transporter, AMT Monoamine transporters; Norepinephrine & serotonin Slc6a4 Sodium-dependent serotonin transporter (SERT) | imipramine receptor
Type:
Multi-pass membrane protein
Mol. Mass.:
70168.43
Organism:
Rattus norvegicus (rat)
Description:
P31652
Residue:
630
  
Inhibitor
Name:
BDBM50106860
Synonyms:
8-(3-Fluoro-propyl)-3-(4-iodo-phenyl)-8-aza-bicyclo[3.2.1]octane-2-carboxylic acid 2-fluoro-ethyl ester | CHEMBL317444
Type:
Small organic molecule
Emp. Form.:
C19H24F2INO2
Mol. Mass.:
463.3006
SMILES:
FCCCN1C2CCC1C(C(C2)c1ccc(I)cc1)C(=O)OCCF
: