Target
Glucocorticoid receptor
Ligand
BDBM50103249
Substrate
Meas. Tech.
ChEMBL_71397 (CHEMBL681749)
Ki
4±n/a nM
Citation
 Elmore, SWCoghlan, MJAnderson, DDPratt, JKGreen, BEWang, AXStashko, MALin, CWTyree, CMMiner, JNJacobson, PBWilcox, DMLane, BC Nonsteroidal selective glucocorticoid modulators: the effect of C-5 alkyl substitution on the transcriptional activation/repression profile of 2,5-dihydro-10-methoxy-2,2,4-trimethyl-1H-[1]benzopyrano[3,4-f]quinolines. J Med Chem 44:4481-91 (2001)  
Target
Name:
Glucocorticoid receptor
Synonyms:
GCR_HUMAN GRL Glucocorticoid receptor (GRFP) Nuclear receptor subfamily 3 group C member 1
Type:
Enzyme
Mol. Mass.:
85656.87
Organism:
Homo sapiens (Human)
Description:
P04150
Residue:
777
  
Inhibitor
Name:
BDBM50103249
Synonyms:
10-Methoxy-2,2,4-trimethyl-5-(3-methylsulfanylmethoxy-phenyl)-2,5-dihydro-1H-6-oxa-1-aza-chrysene | CHEMBL97206
Type:
Small organic molecule
Emp. Form.:
C28H29NO3S
Mol. Mass.:
459.6
SMILES:
COc1cccc2OC(c3cccc(OCSC)c3)c3c(ccc4NC(C)(C)C=C(C)c34)-c12
: