Target
D(3) dopamine receptor
Ligand
BDBM50107882
Substrate
Meas. Tech.
ChEMBL_62758 (CHEMBL676127)
Ki
23±n/a nM
Citation
 Haadsma-Svensson, SRCleek, KADinh, DMDuncan, JNHaber, CLHuff, RMLajiness, MENichols, NFSmith, MWSvensson, KAZaya, MJCarlsson, ALin, CH Dopamine D(3) receptor antagonists. 1. Synthesis and structure-activity relationships of 5,6-dimethoxy-N-alkyl- and N-alkylaryl-substituted 2-aminoindans. J Med Chem 44:4716-32 (2001)  
Target
Name:
D(3) dopamine receptor
Synonyms:
DOPAMINE D3 Dopamine D3 receptor | Drd3
Type:
Protein
Mol. Mass.:
49540.58
Organism:
Rattus norvegicus (Rat)
Description:
P19020
Residue:
446
  
Inhibitor
Name:
BDBM50107882
Synonyms:
(5,6-Dimethoxy-indan-2-yl)-(3-phenyl-propyl)-propyl-amine | CHEMBL142197
Type:
Small organic molecule
Emp. Form.:
C23H31NO2
Mol. Mass.:
353.4977
SMILES:
CCCN(CCCc1ccccc1)C1Cc2cc(OC)c(OC)cc2C1
: