Target
Fibroblast growth factor 23
Ligand
BDBM50549232
Substrate
Meas. Tech.
ChEMBL_2024190 (CHEMBL4678003)
IC50
5000±n/a nM
Citation
 Downs, RPXiao, ZIkedionwu, MOCleveland, JWLin Chin, ACafferty, AEDarryl Quarles, LCarrick, JD Design and development of FGF-23 antagonists: Definition of the pharmacophore and initial structure-activity relationships probed by synthetic analogues. Bioorg Med Chem 29:0 (2021)  
Target
Name:
Fibroblast growth factor 23
Synonyms:
FGF-23 FGF23_HUMAN Fibroblast growth factor 23 C-terminal peptide HYPF Phosphatonin | Tumor-derived hypophosphatemia-inducing factor
Type:
PROTEIN
Mol. Mass.:
27966.65
Organism:
Homo sapiens
Description:
ChEMBL_115874
Residue:
251
  
Inhibitor
Name:
BDBM50549232
Synonyms:
CHEMBL4764072
Type:
Small organic molecule
Emp. Form.:
C14H15NO
Mol. Mass.:
213.275
SMILES:
O\N=C\C1=C(CCC1)/C=C/c1ccccc1
: