Target
Rho-associated protein kinase 1
Ligand
BDBM50549400
Substrate
Meas. Tech.
ChEMBL_2024616 (CHEMBL4678429)
Ki
10.0±n/a nM
Citation
 Bandarage, UKCourt, JGao, HNanthakumar, SCome, JHGiroux, SGreen, J ROCK inhibitors 4: Structure-activity relationship studies of 7-azaindole-based rho kinase (ROCK) inhibitors. Bioorg Med Chem Lett 33:0 (2021)  
Target
Name:
Rho-associated protein kinase 1
Synonyms:
ROCK-I ROCK1_HUMAN Rho-associated protein kinase Rho-associated, coiled-coil-containing protein kinase 1 Rho-kinase (ROCK I) p160 ROCK-1 | p160ROCK
Type:
Serine/threonine-protein kinase
Mol. Mass.:
158156.77
Organism:
Homo sapiens (Human)
Description:
Q13464
Residue:
1354
  
Inhibitor
Name:
BDBM50549400
Synonyms:
CHEMBL4754398
Type:
Small organic molecule
Emp. Form.:
C19H17N5O3S2
Mol. Mass.:
427.5
SMILES:
CS(=O)(=O)Nc1cccc(CC(=O)Nc2cnc(s2)-c2c[nH]c3ncccc23)c1
: