Target
Prostaglandin G/H synthase 2
Ligand
BDBM50057555
Substrate
Meas. Tech.
ChEBML_159922
IC50
290±n/a nM
Citation
 Wesolowski, SSJorgensen, WL Estimation of binding affinities for celecoxib analogues with COX-2 via Monte Carlo-extended linear response. Bioorg Med Chem Lett 12:267-70 (2002)  
Target
Name:
Prostaglandin G/H synthase 2
Synonyms:
COX2 Cyclooxygenase 2 (COX-2) Cyclooxygenase-2 (COX-2 AA) Cyclooxygenase-2 (COX-2) PGH2_HUMAN PHS II Prostaglandin E synthase/G/H synthase 2 Prostaglandin-endoperoxide synthase 2
Type:
Enzyme
Mol. Mass.:
69003.89
Organism:
Homo sapiens (Human)
Description:
Recombinant Cox-2 provided by Cayman (Cayman Chemical Co.,Ann Arbor, MI).
Residue:
604
  
Inhibitor
Name:
BDBM50057555
Synonyms:
4-[5-(2-Methoxy-phenyl)-3-trifluoromethyl-pyrazol-1-yl]-benzenesulfonamide | CHEMBL29942
Type:
Small organic molecule
Emp. Form.:
C17H14F3N3O3S
Mol. Mass.:
397.372
SMILES:
COc1ccccc1-c1cc(nn1-c1ccc(cc1)S(N)(=O)=O)C(F)(F)F
: