Target
Cereblon isoform 4
Ligand
BDBM50026472
Substrate
Meas. Tech.
ChEMBL_2025841 (CHEMBL4679654)
Ki
11000000±n/a nM
Citation
 Maiwald, SHeim, CHernandez Alvarez, BHartmann, MD Sweet and Blind Spots in E3 Ligase Ligand Space Revealed by a Thermophoresis-Based Assay. ACS Med Chem Lett 12:74-81 (2021)  
Target
Name:
Cereblon isoform 4
Synonyms:
Cereblon isoform 4
Type:
PROTEIN
Mol. Mass.:
13620.40
Organism:
Magnetospirillum gryphiswaldense
Description:
ChEMBL_116733
Residue:
124
  
Inhibitor
Name:
BDBM50026472
Synonyms:
(CH3)2SO CHEMBL504 Dimethylsulfoxid US11866416, Compound DMSO dimethyl sulphoxide methylsulfinylmethane | sulfinylbis(methane)
Type:
Small organic molecule
Emp. Form.:
C2H6OS
Mol. Mass.:
78.133
SMILES:
CS(C)=O
: