Target
Urokinase-type plasminogen activator
Ligand
BDBM50109379
Substrate
Meas. Tech.
ChEBML_212981
Ki
531.0±n/a nM
Citation
 Rudolph, MJIllig, CRSubasinghe, NLWilson, KJHoffman, JBRandle, TGreen, DMolloy, CJSoll, RMLewandowski, FZhang, MBone, RSpurlino, JCDeckman, ICManthey, CSharp, CMaguire, DGrasberger, BLDesJarlais, RLZhou, Z Design and synthesis of 4,5-disubstituted-thiophene-2-amidines as potent urokinase inhibitors. Bioorg Med Chem Lett 12:491-5 (2002)  
Target
Name:
Urokinase-type plasminogen activator
Synonyms:
3.4.21.73 U-plasminogen activator Urokinase Urokinase-type plasminogen activator chain B Urokinase-type plasminogen activator short chain A uPA
Type:
Enzyme
Mol. Mass.:
48528.62
Organism:
Homo sapiens (Human)
Description:
P00749
Residue:
431
  
Inhibitor
Name:
BDBM50109379
Synonyms:
5-Methoxy-4-(4-phenyl-thiazol-2-yl)-thiophene-2-carboxamidine | CHEMBL322207
Type:
Small organic molecule
Emp. Form.:
C15H13N3OS2
Mol. Mass.:
315.413
SMILES:
COc1sc(cc1-c1nc(cs1)-c1ccccc1)C(N)=N
: