Target
Bifunctional dihydrofolate reductase-thymidylate synthase
Ligand
BDBM50110767
Substrate
Meas. Tech.
ChEMBL_55400 (CHEMBL668409)
Ki
2.8±n/a nM
Citation
 Tarnchompoo, BSirichaiwat, CPhupong, WIntaraudom, CSirawaraporn, WKamchonwongpaisan, SVanichtanankul, JThebtaranonth, YYuthavong, Y Development of 2,4-diaminopyrimidines as antimalarials based on inhibition of the S108N and C59R+S108N mutants of dihydrofolate reductase from pyrimethamine-resistant Plasmodium falciparum. J Med Chem 45:1244-52 (2002)  
Target
Name:
Bifunctional dihydrofolate reductase-thymidylate synthase
Synonyms:
DHFR-TS Dihydrofolate Reductase-Thymidylate Synthase (DHFR-TS) Mutant KICB1 PfDHFR-TS double mutant (C59R+S108N)
Type:
Enzyme
Mol. Mass.:
71822.51
Organism:
Plasmodium falciparum (isolate K1 / Thailand)
Description:
The mutant clone was prepared by cassette mutagenesis using wildtype pfDHFR as a template, and expressed in E. coli.
Residue:
608
  
Inhibitor
Name:
BDBM50110767
Synonyms:
4-[2,6-Diamino-5-(3-chloro-phenyl)-pyrimidin-4-yl]-butyric acid methyl ester | CHEMBL21494
Type:
Small organic molecule
Emp. Form.:
C15H17ClN4O2
Mol. Mass.:
320.774
SMILES:
COC(=O)CCCc1nc(N)nc(N)c1-c1cccc(Cl)c1
: