Target
Sodium-dependent serotonin transporter
Ligand
BDBM50110782
Substrate
Meas. Tech.
ChEMBL_226364 (CHEMBL847532)
Ki
0.98±n/a nM
Citation
 Emond, PVercouillie, JInnis, RChalon, SMavel, SFrangin, YHalldin, CBesnard, JCGuilloteau, D Substituted diphenyl sulfides as selective serotonin transporter ligands: synthesis and in vitro evaluation. J Med Chem 45:1253-8 (2002)  
Target
Name:
Sodium-dependent serotonin transporter
Synonyms:
5-HT Transporter 5HT transporter Anandamid membrane transporter, AMT Monoamine transporters; Norepinephrine & serotonin Slc6a4 Sodium-dependent serotonin transporter (SERT) | imipramine receptor
Type:
Multi-pass membrane protein
Mol. Mass.:
70168.43
Organism:
Rattus norvegicus (rat)
Description:
P31652
Residue:
630
  
Inhibitor
Name:
BDBM50110782
Synonyms:
CHEMBL429065 | [5-Iodo-2-(2-methylaminomethyl-phenylsulfanyl)-phenyl]-methanol
Type:
Small organic molecule
Emp. Form.:
C15H16INOS
Mol. Mass.:
385.263
SMILES:
CNCc1ccccc1Sc1ccc(I)cc1CO
: