Target
Dihydrofolate reductase
Ligand
BDBM50111550
Substrate
Meas. Tech.
ChEMBL_54285 (CHEMBL666804)
Ki
0.00033±n/a nM
Citation
 Vaidya, CMWright, JERosowsky, A Synthesis and in vitro antitumor activity of new deaza analogues of the nonpolyglutamatable antifolate N(alpha)-(4-amino-4-deoxypteroyl)-N(delta)-hemiphthaloyl-L-ornithine (PT523). J Med Chem 45:1690-6 (2002)  
Target
Name:
Dihydrofolate reductase
Synonyms:
DHFR Dihydrofolate reductase (DHFR) | Tetrahydrofolate dehydrogenase
Type:
Enzyme
Mol. Mass.:
21453.99
Organism:
Homo sapiens (Human)
Description:
Recombinant human DHFR.
Residue:
187
  
Inhibitor
Name:
BDBM50111550
Synonyms:
CHEMBL296545 | N-(4-Carboxy-4-{4-[(6,8-diamino-quinoxalin-2-ylmethyl)-amino]-benzoylamino}-butyl)-phthalamic acid
Type:
Small organic molecule
Emp. Form.:
C29H29N7O6
Mol. Mass.:
571.5839
SMILES:
Nc1cc(N)c2nc(CNc3ccc(cc3)C(=O)NC(CCCNC(=O)c3ccccc3C(O)=O)C(O)=O)cnc2c1
: