Target
Delta-type opioid receptor
Ligand
BDBM50111905
Substrate
Meas. Tech.
ChEBML_145885
IC50
0.022000±n/a nM
Citation
 Ambo, AMurase, HNiizuma, HOuchi, HYamamoto, YSasaki, Y Dermorphin and deltorphin heptapeptide analogues: replacement of Phe residue by Dmp greatly improves opioid receptor affinity and selectivity. Bioorg Med Chem Lett 12:879-81 (2002)  
Target
Name:
Delta-type opioid receptor
Synonyms:
DOR-1 MSL-2 OPRD_MOUSE Oprd1
Type:
Enzyme Catalytic Domain
Mol. Mass.:
40577.25
Organism:
MOUSE
Description:
P32300
Residue:
372
  
Inhibitor
Name:
BDBM50111905
Synonyms:
(S)-4-[(S)-2-{(S)-2-[(S)-2-Amino-3-(4-hydroxy-phenyl)-propionylamino]-propionylamino}-3-(2,6-dimethyl-phenyl)-propionylamino]-4-{(S)-1-[(S)-1-(carbamoylmethyl-carbamoyl)-2-methyl-propylcarbamoyl]-2-methyl-propylcarbamoyl}-butyric acid | CHEMBL169860
Type:
Small organic molecule
Emp. Form.:
C40H58N8O10
Mol. Mass.:
810.9361
SMILES:
CC(C)[C@H](NC(=O)[C@@H](NC(=O)[C@H](CCC(O)=O)NC(=O)[C@H](Cc1c(C)cccc1C)NC(=O)[C@H](C)NC(=O)[C@@H](N)Cc1ccc(O)cc1)C(C)C)C(=O)NCC(N)=O
: