Target
Adenosine kinase
Ligand
BDBM50090837
Substrate
Meas. Tech.
ChEMBL_31119 (CHEMBL643547)
IC50
100±n/a nM
Citation
 Srikanth, KDebnath, BJha, T QSAR study on adenosine kinase inhibition of pyrrolo[2,3-d]pyrimidine nucleoside analogues using the hansch approach. Bioorg Med Chem Lett 12:899-902 (2002)  
Target
Name:
Adenosine kinase
Synonyms:
ADK | ADK_HUMAN
Type:
PROTEIN
Mol. Mass.:
40545.97
Organism:
Homo sapiens (Human)
Description:
ChEMBL_1467841
Residue:
362
  
Inhibitor
Name:
BDBM50090837
Synonyms:
(2R,3R,4S,5R)-2-(4-Amino-5-iodo-pyrrolo[2,3-d]pyrimidin-7-yl)-5-vinyl-tetrahydro-furan-3,4-diol 2-(4-Amino-5-iodo-pyrrolo[2,3-d]pyrimidin-7-yl)-5-vinyl-tetrahydro-furan-3,4-diol | CHEMBL97553
Type:
Small organic molecule
Emp. Form.:
C12H13IN4O3
Mol. Mass.:
388.1611
SMILES:
Nc1ncnc2n(cc(I)c12)[C@@H]1O[C@H](C=C)[C@@H](O)[C@H]1O
: