Target
Adenosine kinase
Ligand
BDBM50090848
Substrate
Meas. Tech.
ChEMBL_31119 (CHEMBL643547)
IC50
1200±n/a nM
Citation
 Srikanth, KDebnath, BJha, T QSAR study on adenosine kinase inhibition of pyrrolo[2,3-d]pyrimidine nucleoside analogues using the hansch approach. Bioorg Med Chem Lett 12:899-902 (2002)  
Target
Name:
Adenosine kinase
Synonyms:
ADK | ADK_HUMAN
Type:
PROTEIN
Mol. Mass.:
40545.97
Organism:
Homo sapiens (Human)
Description:
ChEMBL_1467841
Residue:
362
  
Inhibitor
Name:
BDBM50090848
Synonyms:
(2R,3S,4R,5R)-2-(hydroxymethyl)-5-(5-iodo-4-(methylamino)-7H-pyrrolo[2,3-d]pyrimidin-7-yl)-tetrahydrofuran-3,4-diol 2-Hydroxymethyl-5-(5-iodo-4-methylamino-pyrrolo[2,3-d]pyrimidin-7-yl)-tetrahydro-furan-3,4-diol | CHEMBL319177
Type:
Small organic molecule
Emp. Form.:
C12H15IN4O4
Mol. Mass.:
406.1764
SMILES:
CNc1ncnc2n(cc(I)c12)[C@@H]1O[C@H](CO)[C@@H](O)[C@H]1O
: