Target
5'-nucleotidase
Ligand
BDBM4078
Substrate
Meas. Tech.
ChEMBL_2034690 (CHEMBL4688848)
IC50
40±n/a nM
Citation
 Wang, YWang, CZhu, YZhang, YChen, BWu, YYao, JMiao, Z Discovery of natural product ellagic acid as a potent CD73 and CD39 dual inhibitor. Bioorg Med Chem Lett 34:0 (2021)  
Target
Name:
5'-nucleotidase
Synonyms:
3.1.3.5 CD_antigen=CD73 Nt5e | Nte
Type:
PROTEIN
Mol. Mass.:
63864.64
Organism:
Mus musculus
Description:
ChEMBL_120102
Residue:
576
  
Inhibitor
Name:
BDBM4078
Synonyms:
6,7,13,14-tetrahydroxy-2,9-dioxatetracyclo[6.6.2.0^{4,16}.0^{11,15}]hexadeca-1(14),4(16),5,7,11(15),12-hexaene-3,10-dione ELLAGIC ACID Ellagic acid (18) MLS000069632 cid_5281855
Type:
Small organic molecule
Emp. Form.:
C14H6O8
Mol. Mass.:
302.1926
SMILES:
Oc1cc2c3c(oc(=O)c4cc(O)c(O)c(oc2=O)c34)c1O
: