Target
Ectonucleoside triphosphate diphosphohydrolase 1
Ligand
BDBM4078
Substrate
Meas. Tech.
ChEMBL_2034691 (CHEMBL4688849)
IC50
500±n/a nM
Citation
 Wang, YWang, CZhu, YZhang, YChen, BWu, YYao, JMiao, Z Discovery of natural product ellagic acid as a potent CD73 and CD39 dual inhibitor. Bioorg Med Chem Lett 34:0 (2021)  
Target
Name:
Ectonucleoside triphosphate diphosphohydrolase 1
Synonyms:
3.6.1.5 Cd39 Ecto-ATP diphosphohydrolase 1 Ecto-ATPase 1 Ectonucleoside triphosphate diphosphohydrolase 1 Lymphoid cell activation antigen | NTPDase 1
Type:
PROTEIN
Mol. Mass.:
57200.10
Organism:
Mus musculus
Description:
ChEMBL_120146
Residue:
510
  
Inhibitor
Name:
BDBM4078
Synonyms:
6,7,13,14-tetrahydroxy-2,9-dioxatetracyclo[6.6.2.0^{4,16}.0^{11,15}]hexadeca-1(14),4(16),5,7,11(15),12-hexaene-3,10-dione ELLAGIC ACID Ellagic acid (18) MLS000069632 cid_5281855
Type:
Small organic molecule
Emp. Form.:
C14H6O8
Mol. Mass.:
302.1926
SMILES:
Oc1cc2c3c(oc(=O)c4cc(O)c(O)c(oc2=O)c34)c1O
: