Target
Serine protease 1
Ligand
BDBM50112512
Substrate
Meas. Tech.
ChEBML_213077
Ki
73±n/a nM
Citation
 Shaw, KJGuilford, WJGriedel, BDSakata, STrinh, LWu, SXu, WZhao, ZMorrissey, MM Benzimidazole-based fXa inhibitors with improved thrombin and trypsin selectivity. Bioorg Med Chem Lett 12:1311-4 (2002)  
Target
Name:
Serine protease 1
Synonyms:
Alpha-trypsin chain 1 Beta-trypsin PRSS1 TRP1 TRY1_HUMAN Thrombin & trypsin Trypsin I | Trypsin-1
Type:
Enzyme
Mol. Mass.:
26557.80
Organism:
Homo sapiens (Human)
Description:
P07477
Residue:
247
  
Inhibitor
Name:
BDBM50112512
Synonyms:
3-(3-{2-Ethyl-6-[1-(1-imino-ethyl)-piperidin-4-yloxy]-benzoimidazol-1-yl}-2-methyl-propenyl)-phenylamine | CHEMBL25478
Type:
Small organic molecule
Emp. Form.:
C26H33N5O
Mol. Mass.:
431.5731
SMILES:
CCc1nc2ccc(OC3CCN(CC3)C(C)=N)cc2n1CC(C)=Cc1cccc(N)c1
: