Target
Methionine--tRNA ligase, mitochondrial
Ligand
BDBM50553187
Substrate
Meas. Tech.
ChEMBL_2045379 (CHEMBL4700078)
EC50
195±n/a nM
Citation
 Zhang, ZBarros-Álvarez, XGillespie, JRRanade, RMHuang, WShibata, SMolasky, NMRFaghih, OMushtaq, AChoy, RKMde Hostos, EHol, WGJVerlinde, CLMJBuckner, FSFan, E Structure-guided discovery of selective methionyl-tRNA synthetase inhibitors with potent activity against  RSC Med Chem 11:885-895 (2020)  
Target
Name:
Methionine--tRNA ligase, mitochondrial
Synonyms:
6.1.1.10 Methionine--tRNA ligase, mitochondrial Mitochondrial methionyl-tRNA synthetase SYMM_HUMAN
Type:
PROTEIN
Mol. Mass.:
66605.24
Organism:
Homo sapiens
Description:
ChEMBL_120165
Residue:
593
  
Inhibitor
Name:
BDBM50553187
Synonyms:
CHEMBL4761163
Type:
Small organic molecule
Emp. Form.:
C20H18Cl2FN5O
Mol. Mass.:
434.294
SMILES:
CCCn1c(Cc2ccc(Cl)cc2Cl)cn(Cc2nc3nc(F)ccc3[nH]2)c1=O
: