Target
Golgi-associated PDZ and coiled-coil motif-containing protein
Ligand
BDBM50555247
Substrate
Meas. Tech.
ChEMBL_2051632 (CHEMBL4706331)
IC50
150±n/a nM
Citation
 Dougherty, PGWellmerling, JHKoley, ALukowski, JKHummon, ABCormet-Boyaka, EPei, D Cyclic Peptidyl Inhibitors against CAL/CFTR Interaction for Treatment of Cystic Fibrosis. J Med Chem 63:15773-15784 (2020)  
Target
Name:
Golgi-associated PDZ and coiled-coil motif-containing protein
Synonyms:
CAL FIG GOPC Golgi-associated PDZ and coiled-coil motif-containing protein PIST
Type:
PROTEIN
Mol. Mass.:
50511.32
Organism:
Homo sapiens
Description:
ChEMBL_117103
Residue:
462
  
Inhibitor
Name:
BDBM50555247
Synonyms:
CHEMBL4789394
Type:
Small organic molecule
Emp. Form.:
C73H113N25O15S2
Mol. Mass.:
1644.967
SMILES:
C[C@@H](O)[C@H](NC(=O)[C@@H](NC(=O)[C@H](CCC(N)=O)NC(=O)[C@H](Cc1c[nH]c2ccccc12)NC(=O)[C@H](Cc1cccc2ccccc12)NC(=O)[C@H](CCCNC(N)=N)NC(=O)[C@H](CCCNC(N)=N)NC(=O)[C@H](CCCNC(N)=N)NC(=O)[C@H](CS)NC(C)=O)C(C)(C)S)C(=O)N[C@@H](CCCNC(N)=N)C(=O)N[C@H](C(O)=O)C(C)(C)C
: