Target
Inosine-5'-monophosphate dehydrogenase 2
Ligand
BDBM50116145
Substrate
Meas. Tech.
ChEBML_89931
IC50
78±n/a nM
Citation
 Pitts, WJGuo, JDhar, TGShen, ZGu, HHWatterson, SHBednarz, MSChen, BCBarrish, JCBassolino, DCheney, DFleener, CARouleau, KAHollenbaugh, DLIwanowicz, EJ Rapid synthesis of triazine inhibitors of inosine monophosphate dehydrogenase. Bioorg Med Chem Lett 12:2137-40 (2002)  
Target
Name:
Inosine-5'-monophosphate dehydrogenase 2
Synonyms:
IMDH2_HUMAN IMPD 2 IMPDH-II Inosine 5'-monophosphate dehydrogenase II (IMPDH II) Inosine-5 -monophosphate dehydrogenase 2 | Inosine-5'-monophosphate dehydrogenase (IMPDH)
Type:
Enzyme
Mol. Mass.:
55806.87
Organism:
Homo sapiens (Human)
Description:
Recombinant IMPDH2 expressed in E. coli.
Residue:
514
  
Inhibitor
Name:
BDBM50116145
Synonyms:
4-[4-(3-Methoxy-4-oxazol-5-yl-phenylamino)-6-phenyl-[1,3,5]triazin-2-ylamino]-butyric acid | CHEMBL66455
Type:
Small organic molecule
Emp. Form.:
C23H22N6O4
Mol. Mass.:
446.4586
SMILES:
COc1cc(Nc2nc(NCCCC(O)=O)nc(n2)-c2ccccc2)ccc1-c1cnco1
: