Target
Adenosine receptor A2a
Ligand
BDBM50117108
Substrate
Meas. Tech.
ChEMBL_30923 (CHEMBL647733)
Ki
97.6±n/a nM
Citation
 Maconi, APastorin, GDa Ros, TSpalluto, GGao, ZGJacobson, KABaraldi, PGCacciari, BVarani, KMoro, SBorea, PA Synthesis, biological properties, and molecular modeling investigation of the first potent, selective, and water-soluble human A(3) adenosine receptor antagonist. J Med Chem 45:3579-82 (2002)  
Target
Name:
Adenosine receptor A2a
Synonyms:
AA2AR_RAT Adenosine A2 receptor Adenosine Receptors A2a (A2a) Adenosine receptors A2a Rat striatal adenosine A2a receptor
Type:
G Protein-Coupled Receptor (GPCR)
Mol. Mass.:
45015.65
Organism:
Rattus norvegicus (rat)
Description:
Rat A2A receptors expressed in CHO cells.
Residue:
410
  
Inhibitor
Name:
BDBM50117108
Synonyms:
4-[3-(2-Furan-2-yl-8-methyl-8H-pyrazolo[4,3-e][1,2,4]triazolo[1,5-c]pyrimidin-5-yl)-ureido]-pyridinium; chloride CHEMBL118923
Type:
Small organic molecule
Emp. Form.:
C17H14N9O2
Mol. Mass.:
376.3516
SMILES:
Cn1cc2c(n1)nc(NC(=O)Nc1cc[nH+]cc1)n1nc(nc21)-c1ccco1
: