Target
Adenosine kinase
Ligand
BDBM50117175
Substrate
Meas. Tech.
ChEMBL_31124 (CHEMBL643552)
IC50
2.5±n/a nM
Citation
 Gomtsyan, ADidomenico, SLee, CHMatulenko, MAKim, KKowaluk, EAWismer, CTMikusa, JYu, HKohlhaas, KJarvis, MFBhagwat, SS Design, synthesis, and structure-activity relationship of 6-alkynylpyrimidines as potent adenosine kinase inhibitors. J Med Chem 45:3639-48 (2002)  
Target
Name:
Adenosine kinase
Synonyms:
ADENOSINE Adenosine 5-phosphotransferase Adenosine kinase | Adk
Type:
Enzyme
Mol. Mass.:
40130.14
Organism:
Rattus norvegicus (rat)
Description:
Rat brain cytosol as enzyme source.
Residue:
361
  
Inhibitor
Name:
BDBM50117175
Synonyms:
5-[3-(2-Chloro-phenyl)-propyl]-6-(6-morpholin-4-yl-pyridin-3-ylethynyl)-pyrimidin-4-ylamine | CHEMBL120977
Type:
Small organic molecule
Emp. Form.:
C24H24ClN5O
Mol. Mass.:
433.933
SMILES:
Nc1ncnc(C#Cc2ccc(nc2)N2CCOCC2)c1CCCc1ccccc1Cl
: