Target
Adenosine receptor A3
Ligand
BDBM50117226
Substrate
Meas. Tech.
ChEMBL_31413 (CHEMBL644556)
IC50
0.27±n/a nM
Citation
 Okamura, TKurogi, YNishikawa, HHashimoto, KFujiwara, HNagao, Y 1,2,4-Triazolo[5,1-i]purine derivatives as highly potent and selective human adenosine A(3) receptor ligands. J Med Chem 45:3703-8 (2002)  
Target
Name:
Adenosine receptor A3
Synonyms:
A3 adenosine receptor (hA3) ADORA3 | Adenosine A3 receptor (A3AR)
Type:
G Protein-Coupled Receptor (GPCR)
Mol. Mass.:
36197.32
Organism:
Homo sapiens (Human)
Description:
P0DMS8
Residue:
318
  
Inhibitor
Name:
BDBM50117226
Synonyms:
5-Butyl-8-m-tolyl-3H-[1,2,4]triazolo[5,1-i]purine | CHEMBL122685
Type:
Small organic molecule
Emp. Form.:
C17H18N6
Mol. Mass.:
306.365
SMILES:
CCCCc1nc2nc[nH]c2c2nc(nn12)-c1cccc(C)c1
: