Target
G-protein coupled receptor 84
Ligand
BDBM50239172
Substrate
Meas. Tech.
ChEMBL_2057173 (CHEMBL4712174)
EC50
295±n/a nM
Citation
 Chen, LHZhang, QXie, XNan, FJ Modulation of the G-Protein-Coupled Receptor 84 (GPR84) by Agonists and Antagonists. J Med Chem 63:15399-15409 (2020)  
Target
Name:
G-protein coupled receptor 84
Synonyms:
G-protein coupled receptor 84 Gpr84
Type:
PROTEIN
Mol. Mass.:
43740.69
Organism:
Mus musculus
Description:
ChEMBL_119136
Residue:
396
  
Inhibitor
Name:
BDBM50239172
Synonyms:
CHEMBL4088884
Type:
Small organic molecule
Emp. Form.:
C17H10F4N2
Mol. Mass.:
318.2683
SMILES:
Fc1cc(F)c2[nH]cc(Cc3c[nH]c4c(F)cc(F)cc34)c2c1
: