Target
Alpha-1A adrenergic receptor
Ligand
BDBM50118703
Substrate
Meas. Tech.
ChEMBL_33550 (CHEMBL647809)
EC50
9.3±n/a nM
Citation
 Altenbach, RJKhilevich, AMeyer, MDBuckner, SAMilicic, IDaza, AVBrune, MEO'Neill, ABGauvin, DMCain, JCNakane, MHolladay, MWWilliams, MBrioni, JDSullivan, JP N-[3-(1H-imidazol-4-ylmethyl)phenyl]ethanesulfonamide (ABT-866, 1),(1) a novel alpha(1)-adrenoceptor ligand with an enhanced in vitro and in vivo profile relative to phenylpropanolamine and midodrine. J Med Chem 45:4395-7 (2002)  
Target
Name:
Alpha-1A adrenergic receptor
Synonyms:
ADA1A_HUMAN ADRA1C Alpha 1A-adrenoceptor Alpha adrenergic receptor 1a Alpha-adrenergic receptor 1c adrenergic Alpha1 | adrenergic Alpha1C
Type:
Cell-surface receptors
Mol. Mass.:
51511.67
Organism:
Homo sapiens (Human)
Description:
P35348
Residue:
466
  
Inhibitor
Name:
BDBM50118703
Synonyms:
CHEMBL109783 | N-[5-(4,5-Dihydro-1H-imidazol-2-yl)-2-hydroxy-5,6,7,8-tetrahydro-naphthalen-1-yl]-methanesulfonamide
Type:
Small organic molecule
Emp. Form.:
C14H19N3O3S
Mol. Mass.:
309.384
SMILES:
CS(=O)(=O)Nc1c(O)ccc2C(CCCc12)C1=NCCN1
: