Target
Alpha-1A adrenergic receptor
Ligand
BDBM50022722
Substrate
Meas. Tech.
ChEMBL_33281 (CHEMBL644241)
Ki
9800.0±n/a nM
Citation
 Altenbach, RJKhilevich, AMeyer, MDBuckner, SAMilicic, IDaza, AVBrune, MEO'Neill, ABGauvin, DMCain, JCNakane, MHolladay, MWWilliams, MBrioni, JDSullivan, JP N-[3-(1H-imidazol-4-ylmethyl)phenyl]ethanesulfonamide (ABT-866, 1),(1) a novel alpha(1)-adrenoceptor ligand with an enhanced in vitro and in vivo profile relative to phenylpropanolamine and midodrine. J Med Chem 45:4395-7 (2002)  
Target
Name:
Alpha-1A adrenergic receptor
Synonyms:
ADA1A_RAT Adra1c Alpha-1A adrenoceptor Alpha-1C adrenergic receptor | adrenergic Alpha1A
Type:
Protein
Mol. Mass.:
51620.15
Organism:
Rattus norvegicus (Rat)
Description:
P43140
Residue:
466
  
Inhibitor
Name:
BDBM50022722
Synonyms:
(+)2-Amino-1-phenyl-propan-1-ol (1R, 2S)-2-Amino-1-phenyl-propan-1-ol (1S, 2S)-2-Amino-1-phenyl-propan-1-ol Biphetap Bromatapp Codamine Demazin Dimetapp Hycomine Norephedrine, (-) PHENYLPROPANOLAMINE Pseudonorephedrine, (-) [cathine, (-)] Triaminic-12
Type:
Small organic molecule
Emp. Form.:
C9H13NO
Mol. Mass.:
151.2056
SMILES:
CC(N)C(O)c1ccccc1
: