Target
Tyrosine-protein phosphatase non-receptor type 1
Ligand
BDBM50118756
Substrate
Meas. Tech.
ChEMBL_162283 (CHEMBL770981)
pH
5.5±n/a
Ki
8000±n/a nM
Comments
extracted
Citation
 Andersen, HSOlsen, OHIversen, LFSørensen, ALMortensen, SBChristensen, MSBranner, SHansen, TKLau, JFJeppesen, LMoran, EJSu, JBakir, FJudge, LShahbaz, MCollins, TVo, TNewman, MJRipka, WCMøller, NP Discovery and SAR of a novel selective and orally bioavailable nonpeptide classical competitive inhibitor class of protein-tyrosine phosphatase 1B. J Med Chem 45:4443-59 (2002)  
Target
Name:
Tyrosine-protein phosphatase non-receptor type 1
Synonyms:
PTN1_HUMAN PTPN1 Protein tyrosine phosphatase-1B (PTP1B) Protein-tyrosine phosphatase 1B (PTP1B) Tyrosine-protein phosphatase non-receptor type 1 (PTP1B)
Type:
Protein phosphatase
Mol. Mass.:
49963.76
Organism:
Homo sapiens (Human)
Description:
Human recombinant GST-fusion PTP1B (1-435).
Residue:
435
  
Inhibitor
Name:
BDBM50118756
Synonyms:
3-(carboxyformamido)-5-(3,5-dimethoxyphenyl)thiophene-2-carboxylic acid CHEMBL139491
Type:
Small organic molecule
Emp. Form.:
C15H13NO7S
Mol. Mass.:
351.331
SMILES:
COc1cc(OC)cc(c1)-c1cc(NC(=O)C(O)=O)c(s1)C(O)=O
: