Target
Kinesin-like protein KIF18A
Ligand
BDBM50557717
Substrate
Meas. Tech.
ChEMBL_2059847 (CHEMBL4714848)
IC50
27±n/a nM
Citation
 Sabnis, RW Novel Amide Compounds as KIF18A Inhibitors for Treating Cancer. ACS Med Chem Lett 12:690-691 (2021)  
Target
Name:
Kinesin-like protein KIF18A
Synonyms:
KI18A_HUMAN Kinesin-like protein KIF18A Marrow stromal KIF18A
Type:
PROTEIN
Mol. Mass.:
102320.22
Organism:
Homo sapiens
Description:
ChEMBL_119153
Residue:
898
  
Inhibitor
Name:
BDBM50557717
Synonyms:
CHEMBL4743666
Type:
Small organic molecule
Emp. Form.:
C25H34N4O5S2
Mol. Mass.:
534.691
SMILES:
CC(C)(C)NS(=O)(=O)c1cccc(NC(=O)c2ccc(NS(C)(=O)=O)cc2N2CCC3(CC3)CC2)c1
: