Target
Inosine-5'-monophosphate dehydrogenase 2
Ligand
BDBM50119031
Substrate
Meas. Tech.
ChEBML_88710
IC50
210±n/a nM
Citation
 Watterson, SHLiu, CDhar, TGGu, HHPitts, WJBarrish, JCFleener, CARouleau, KSherbina, NZHollenbaugh, DLIwanowicz, EJ Novel amide-based inhibitors of inosine 5'-monophosphate dehydrogenase. Bioorg Med Chem Lett 12:2879-82 (2002)  
Target
Name:
Inosine-5'-monophosphate dehydrogenase 2
Synonyms:
IMDH2_HUMAN IMPD 2 IMPDH-II Inosine 5'-monophosphate dehydrogenase II (IMPDH II) Inosine-5 -monophosphate dehydrogenase 2 | Inosine-5'-monophosphate dehydrogenase (IMPDH)
Type:
Enzyme
Mol. Mass.:
55806.87
Organism:
Homo sapiens (Human)
Description:
Recombinant IMPDH2 expressed in E. coli.
Residue:
514
  
Inhibitor
Name:
BDBM50119031
Synonyms:
(E)-N-(3-Methoxy-4-oxazol-5-yl-phenyl)-3-p-tolyl-acrylamide | CHEMBL95865
Type:
Small organic molecule
Emp. Form.:
C20H18N2O3
Mol. Mass.:
334.3685
SMILES:
COc1cc(NC(=O)\C=C\c2ccc(C)cc2)ccc1-c1cnco1
: