Target
Integrin alpha-4/beta-7
Ligand
BDBM50119083
Substrate
Meas. Tech.
ChEMBL_217621 (CHEMBL820364)
IC50
170±n/a nM
Citation
 Castanedo, GMSailes, FCDubree, NJNicholas, JBCaris, LClark, KKeating, SMBeresini, MHChiu, HFong, SMarsters, JCJackson, DYSutherlin, DP Solid-phase synthesis of dual alpha4beta1/alpha4beta7 integrin antagonists: two scaffolds with overlapping pharmacophores. Bioorg Med Chem Lett 12:2913-7 (2002)  
Target
Name:
Integrin alpha-4/beta-7
Synonyms:
Integrin α4β7 Integrin alpha-4/beta7 | Integrin alpha4beta7
Type:
Protein Complex
Mol. Mass.:
Description:
The assay uses stably transfected K562 cells expressing human alpha4beta7 integrin.
Components:
This complex has 2 components.
Component 1
Name:
Integrin alpha-4
Synonyms:
CD49 antigen-like family member D CD49d antigen ITA4_HUMAN Integrin alpha-4 Integrin alpha-IV VLA-4 integrin alpha 4 precursor | integrin alpha-4 precursor
Type:
Membrane Protein
Mol. Mass.:
114897.35
Organism:
Homo sapiens (Human)
Description:
P13612
Residue:
1032
  
Component 2
Name:
Integrin beta-7
Synonyms:
ITB7_HUMAN Integrin alpha-4/beta-7 Integrin beta7
Type:
Membrane Protein
Mol. Mass.:
86893.88
Organism:
Homo sapiens (Human)
Description:
P26010
Residue:
798
  
Inhibitor
Name:
BDBM50119083
Synonyms:
(S)-2-(2-Chloro-benzoylamino)-3-(4-phenethylcarbamoyloxy-phenyl)-propionic acid | CHEMBL100782
Type:
Small organic molecule
Emp. Form.:
C25H23ClN2O5
Mol. Mass.:
466.914
SMILES:
OC(=O)[C@H](Cc1ccc(OC(=O)NCCc2ccccc2)cc1)NC(=O)c1ccccc1Cl
: