Target
Inosine-5'-monophosphate dehydrogenase 2
Ligand
BDBM50120002
Substrate
Meas. Tech.
ChEBML_88592
IC50
330±n/a nM
Citation
 Dhar, TGLiu, CPitts, WJGuo, JWatterson, SHGu, HFleener, CARouleau, KSherbina, NZBarrish, JCHollenbaugh, DIwanowicz, EJ A survey of cyclic replacements for the central diamide moiety of inhibitors of inosine monophosphate dehydrogenase. Bioorg Med Chem Lett 12:3125-8 (2002)  
Target
Name:
Inosine-5'-monophosphate dehydrogenase 2
Synonyms:
IMDH2_HUMAN IMPD 2 IMPDH-II Inosine 5'-monophosphate dehydrogenase II (IMPDH II) Inosine-5 -monophosphate dehydrogenase 2 | Inosine-5'-monophosphate dehydrogenase (IMPDH)
Type:
Enzyme
Mol. Mass.:
55806.87
Organism:
Homo sapiens (Human)
Description:
Recombinant IMPDH2 expressed in E. coli.
Residue:
514
  
Inhibitor
Name:
BDBM50120002
Synonyms:
(3-Methoxy-4-oxazol-5-yl-phenyl)-(5-phenyl-[1,3,4]thiadiazol-2-yl)-amine | CHEMBL104282
Type:
Small organic molecule
Emp. Form.:
C18H14N4O2S
Mol. Mass.:
350.394
SMILES:
COc1cc(Nc2nnc(s2)-c2ccccc2)ccc1-c1cnco1
: