Target
Transmembrane protease serine 2
Ligand
BDBM50424712
Substrate
Meas. Tech.
ChEMBL_2067903 (CHEMBL4723156)
EC50
1000±n/a nM
Citation
 Choudhry, NZhao, XXu, DZanin, MChen, WYang, ZChen, J Chinese Therapeutic Strategy for Fighting COVID-19 and Potential Small-Molecule Inhibitors against Severe Acute Respiratory Syndrome Coronavirus 2 (SARS-CoV-2). J Med Chem 63:13205-13227 (2020)  
Target
Name:
Transmembrane protease serine 2
Synonyms:
PRSS10 TMPRSS2 Transmembrane protease serine 2 catalytic chain | Transmembrane protease serine 2 non-catalytic chain
Type:
PROTEIN
Mol. Mass.:
53867.70
Organism:
Homo sapiens (Human)
Description:
ChEMBL_760112
Residue:
492
  
Inhibitor
Name:
BDBM50424712
Synonyms:
CAMOSTAT Foipan
Type:
Small organic molecule
Emp. Form.:
C20H22N4O5
Mol. Mass.:
398.4125
SMILES:
[#6]-[#7](-[#6])-[#6](=O)-[#6]-[#8]-[#6](=O)-[#6]-c1ccc(-[#8]-[#6](=O)-c2ccc(cc2)\[#7]=[#6](\[#7])-[#7])cc1
: