Target
Sodium-dependent serotonin transporter
Ligand
BDBM50063266
Substrate
Meas. Tech.
ChEBML_201797
Kd
0.051±n/a nM
Citation
 Sandell, JYu, MEmond, PGarreau, LChalon, SNågren, KGuilloteau, DHalldin, C Synthesis, radiolabeling and preliminary biological evaluation of radiolabeled 5-methyl-6-nitroquipazine, a potential radioligand for the serotonin transporter. Bioorg Med Chem Lett 12:3611-3 (2002)  
Target
Name:
Sodium-dependent serotonin transporter
Synonyms:
5-HT Transporter 5HT transporter Anandamid membrane transporter, AMT Monoamine transporters; Norepinephrine & serotonin Slc6a4 Sodium-dependent serotonin transporter (SERT) | imipramine receptor
Type:
Multi-pass membrane protein
Mol. Mass.:
70168.43
Organism:
Rattus norvegicus (rat)
Description:
P31652
Residue:
630
  
Inhibitor
Name:
BDBM50063266
Synonyms:
6-Nitro-2-piperazin-1-yl-quinoline CHEMBL41140
Type:
Small organic molecule
Emp. Form.:
C13H14N4O2
Mol. Mass.:
258.2759
SMILES:
[O-][N+](=O)c1ccc2nc(ccc2c1)N1CCNCC1
: