Target
Muscarinic acetylcholine receptor M2
Ligand
BDBM50103773
Substrate
Meas. Tech.
ChEMBL_139759 (CHEMBL748895)
Ki
0.51±n/a nM
Citation
 Wang, YChackalamannil, SHu, ZGreenlee, WJClader, JBoyle, CDKaminski, JJBillard, WBinch, HCrosby, GRuperto, VDuffy, RACohen-Williams, MCoffin, VLCox, KAGrotz, DELachowicz, JE Improving the oral efficacy of CNS drug candidates: discovery of highly orally efficacious piperidinyl piperidine M2 muscarinic receptor antagonists. J Med Chem 45:5415-8 (2002)  
Target
Name:
Muscarinic acetylcholine receptor M2
Synonyms:
ACM2_HUMAN Cholinergic, muscarinic M2 Muscarinic acetylcholine receptor M2 and M5 | RecName: Full=Muscarinic acetylcholine receptor M2
Type:
GPCR
Mol. Mass.:
51730.61
Organism:
Homo sapiens (Human)
Description:
P08172
Residue:
466
  
Inhibitor
Name:
BDBM50103773
Synonyms:
(4-Fluoro-naphthalen-1-yl)-(4-{2-[4-(4-methoxy-benzenesulfonyl)-phenyl]-[1,3]dioxolan-2-yl}-[1,4']bipiperidinyl-1'-yl)-methanone | CHEMBL74141
Type:
Small organic molecule
Emp. Form.:
C37H39FN2O6S
Mol. Mass.:
658.779
SMILES:
COc1ccc(cc1)S(=O)(=O)c1ccc(cc1)C1(OCCO1)C1CCN(CC1)C1CCN(CC1)C(=O)c1ccc(F)c2ccccc12
: