Target
Hematopoietic prostaglandin D synthase
Ligand
BDBM50559399
Substrate
Meas. Tech.
ChEMBL_2069196 (CHEMBL4724449)
IC50
7.2±n/a nM
Citation
 Olson, KLHolt, MCCiske, FLKramer, JBHeiple, PECollins, MLJohnson, CMHo, CSMorano, MIBarrett, SD Novel amide and imidazole compounds as potent hematopoietic prostaglandin D Bioorg Med Chem Lett 34:0 (2021)  
Target
Name:
Hematopoietic prostaglandin D synthase
Synonyms:
GSTS Glutathione-requiring prostaglandin D synthase HPGDS Hematopoietic prostaglandin D synthase Hematopoietic prostaglandin D synthase (HPGDS) PTGDS2 Prostaglandin D Synthase
Type:
Enzyme
Mol. Mass.:
23341.07
Organism:
Homo sapiens (Human)
Description:
The protein was expressed in E. coli strain BL21(DE3) with an N-terminal 6-His tag.
Residue:
199
  
Inhibitor
Name:
BDBM50559399
Synonyms:
CHEMBL4753053
Type:
Small organic molecule
Emp. Form.:
C23H21N5O3
Mol. Mass.:
415.4445
SMILES:
CC(C)(O)c1nc(no1)-c1cccc(CNC(=O)c2cnc(nc2)-c2ccccc2)c1
: