Target
Insulin-like growth factor-binding protein 5
Ligand
BDBM50026472
Substrate
Meas. Tech.
ChEMBL_90429 (CHEMBL697418)
Kd
783000000±n/a nM
Citation
 Kamionka, MRehm, TBeisel, HGLang, KEngh, RAHolak, TA In silico and NMR identification of inhibitors of the IGF-I and IGF-binding protein-5 interaction. J Med Chem 45:5655-60 (2002)  
Target
Name:
Insulin-like growth factor-binding protein 5
Synonyms:
IBP5 IGFBP5 | Insulin-like growth factor binding protein 5
Type:
PROTEIN
Mol. Mass.:
30581.07
Organism:
Homo sapiens (Human)
Description:
ChEMBL_90411
Residue:
272
  
Inhibitor
Name:
BDBM50026472
Synonyms:
(CH3)2SO CHEMBL504 Dimethylsulfoxid US11866416, Compound DMSO dimethyl sulphoxide methylsulfinylmethane | sulfinylbis(methane)
Type:
Small organic molecule
Emp. Form.:
C2H6OS
Mol. Mass.:
78.133
SMILES:
CS(C)=O
: