Target
Formyl peptide receptor 2
Ligand
BDBM50559838
Substrate
Meas. Tech.
ChEMBL_2070443 (CHEMBL4725977)
EC50
0.630000±n/a nM
Citation
 Asahina, YWurtz, NRArakawa, KCarson, NFujii, KFukuchi, KGarcia, RHsu, MYIshiyama, JIto, BKick, ELupisella, JMatsushima, SOhata, KOstrowski, JSaito, YTsuda, KVillarreal, FYamada, HYamaoka, TWexler, RGordon, DKohno, Y Discovery of BMS-986235/LAR-1219: A Potent Formyl Peptide Receptor 2 (FPR2) Selective Agonist for the Prevention of Heart Failure. J Med Chem 63:9003-9019 (2020)  
Target
Name:
Formyl peptide receptor 2
Synonyms:
FPR2_MOUSE Formylpeptide receptor-related sequence 2 Fpr2 N-formylpeptide receptor-like 2
Type:
PROTEIN
Mol. Mass.:
39427.03
Organism:
Mus musculus
Description:
ChEMBL_120178
Residue:
351
  
Inhibitor
Name:
BDBM50559838
Synonyms:
CHEMBL4790836
Type:
Small organic molecule
Emp. Form.:
C19H19F2N3O4
Mol. Mass.:
391.3687
SMILES:
COc1cc(F)c([C@@H]2CNC(=O)[C@H]2NC(=O)Nc2ccc(C)c(O)c2)c(F)c1
: