Target
Prothrombin
Ligand
BDBM50122188
Substrate
Meas. Tech.
ChEBML_208491
Ki
24±n/a nM
Citation
 Sanderson, PECutrona, KJDyer, DLKrueger, JAKuo, LCLewis, SDLucas, BJYan, Y Small, low nanomolar, noncovalent thrombin inhibitors lacking a group to fill the 'distal binding pocket'. Bioorg Med Chem Lett 13:161-4 (2002)  
Target
Name:
Prothrombin
Synonyms:
Activation peptide fragment 1 Coagulation factor II Prothrombin precursor Thrombin heavy chain | Thrombin light chain
Type:
Protein
Mol. Mass.:
70029.57
Organism:
Homo sapiens (Human)
Description:
P00734
Residue:
622
  
Inhibitor
Name:
BDBM50122188
Synonyms:
CHEMBL42091 | N-(2,5-Dichloro-benzyl)-2-(6-methyl-2-oxo-3-phenylmethanesulfonylamino-2H-pyridin-1-yl)-acetamide
Type:
Small organic molecule
Emp. Form.:
C22H21Cl2N3O4S
Mol. Mass.:
494.391
SMILES:
Cc1ccc(NS(=O)(=O)Cc2ccccc2)c(=O)n1CC(=O)NCc1cc(Cl)ccc1Cl
: