Target
Cytochrome P450 2C9
Ligand
BDBM21690
Substrate
Meas. Tech.
ChEMBL_2073862 (CHEMBL4729396)
IC50
>50000±n/a nM
Citation
 Kirk, RBetson, MBingham, MDoyle, PHarvey, RHuxley, AMoat, JPesnot, TTait, MHallworth, SNelson, G Novel C-7 carbon substituted fourth generation fluoroquinolones targeting N. Gonorrhoeae infections. Bioorg Med Chem Lett 30:0 (2020)  
Target
Name:
Cytochrome P450 2C9
Synonyms:
(R)-limonene 6-monooxygenase CP2C9_HUMAN CYP2C9 Cytochrome P450 2C9 (CYP2C9 ) P-450MP P450 PB-1 | S-mephenytoin 4-hydroxylase
Type:
Enzyme
Mol. Mass.:
55636.33
Organism:
Homo sapiens (Human)
Description:
P11712
Residue:
490
  
Inhibitor
Name:
BDBM21690
Synonyms:
1-cyclopropyl-6-fluoro-4-oxo-7-(piperazin-1-yl)-1,4-dihydroquinoline-3-carboxylic acid Bay 09867 Ciprinol Ciprofloxacin US9138393, Ciprofloxacin HCl | US9144538, Ciprofloxacin HCl
Type:
Small organic molecule
Emp. Form.:
C17H18FN3O3
Mol. Mass.:
331.3415
SMILES:
OC(=O)c1cn(C2CC2)c2cc(N3CCNCC3)c(F)cc2c1=O
: