Target
Inosine-5'-monophosphate dehydrogenase 2
Ligand
BDBM50123356
Substrate
Meas. Tech.
ChEBML_89930
IC50
20±n/a nM
Citation
 Dhar, TGWatterson, SHChen, PShen, ZGu, HHNorris, DCarlsen, MHaslow, KDPitts, WJGuo, JChorba, JFleener, CARouleau, KATownsend, RHollenbaugh, DIwanowicz, EJ Quinolone-based IMPDH inhibitors: introduction of basic residues on ring D and SAR of the corresponding mono, di and benzofused analogues. Bioorg Med Chem Lett 13:547-51 (2003)  
Target
Name:
Inosine-5'-monophosphate dehydrogenase 2
Synonyms:
IMDH2_HUMAN IMPD 2 IMPDH-II Inosine 5'-monophosphate dehydrogenase II (IMPDH II) Inosine-5 -monophosphate dehydrogenase 2 | Inosine-5'-monophosphate dehydrogenase (IMPDH)
Type:
Enzyme
Mol. Mass.:
55806.87
Organism:
Homo sapiens (Human)
Description:
Recombinant IMPDH2 expressed in E. coli.
Residue:
514
  
Inhibitor
Name:
BDBM50123356
Synonyms:
7-Methoxy-2-(3-morpholin-4-yl-indan-5-yl)-6-oxazol-5-yl-1H-quinolin-4-one | CHEMBL153411
Type:
Small organic molecule
Emp. Form.:
C26H25N3O4
Mol. Mass.:
443.4944
SMILES:
COc1cc2nc(cc(O)c2cc1-c1cnco1)-c1ccc2CCC(N3CCOCC3)c2c1
: