Target
5'-nucleotidase
Ligand
BDBM50561236
Substrate
Meas. Tech.
ChEMBL_2074449 (CHEMBL4729983)
EC50
46±n/a nM
Citation
 Du, XMoore, JBlank, BREksterowicz, JSutimantanapi, DYuen, NMetzger, TChan, BHuang, TChen, XChen, YDuong, FKong, WChang, JHSun, JZavorotinskaya, TYe, QJunttila, MRNdubaku, CFriedman, LSFantin, VRSun, D Orally Bioavailable Small-Molecule CD73 Inhibitor (OP-5244) Reverses Immunosuppression through Blockade of Adenosine Production. J Med Chem 63:10433-10459 (2020)  
Target
Name:
5'-nucleotidase
Synonyms:
3.1.3.5 CD_antigen=CD73 Nt5e | Nte
Type:
PROTEIN
Mol. Mass.:
63864.64
Organism:
Mus musculus
Description:
ChEMBL_120102
Residue:
576
  
Inhibitor
Name:
BDBM50561236
Synonyms:
CHEMBL4786598 | US11325938, Ex 86
Type:
Small organic molecule
Emp. Form.:
C18H27ClN5O9P
Mol. Mass.:
523.862
SMILES:
OCC(CO)(OC[C@H]1O[C@H]([C@H](O)[C@@H]1O)n1ncc2c(NC3CCCC3)nc(Cl)nc12)P(O)(O)=O
: