Target
Glutamate receptor ionotropic, NMDA 1
Ligand
BDBM50123793
Substrate
Meas. Tech.
ChEMBL_140399 (CHEMBL746725)
IC50
33.0±n/a nM
Citation
 Katayama, SAe, NKodo, TMasumoto, SHourai, STamamura, CTanaka, HNagata, R Tricyclic indole-2-carboxylic acids: highly in vivo active and selective antagonists for the glycine binding site of the NMDA receptor. J Med Chem 46:691-701 (2003)  
Target
Name:
Glutamate receptor ionotropic, NMDA 1
Synonyms:
Glutamate (NMDA) receptor subunit zeta 1 Glutamate-NMDA-Channel Glutamate-NMDA-Polyamine NMDA Nmdar1 | phencyclidine
Type:
Enzyme Catalytic Domain
Mol. Mass.:
105533.40
Organism:
RAT
Description:
P35439
Residue:
938
  
Inhibitor
Name:
BDBM50123793
Synonyms:
3-[(4-Aminomethyl-2-carboxymethoxy-phenylcarbamoyl)-methyl]-7-chloro-1,3,4,5-tetrahydro-benzo[cd]indole-2-carboxylic acid | CHEMBL161406
Type:
Small organic molecule
Emp. Form.:
C23H22ClN3O6
Mol. Mass.:
471.89
SMILES:
NCc1ccc(NC(=O)C[C@@H]2CCc3cc(Cl)cc4[nH]c(C(O)=O)c2c34)c(OCC(O)=O)c1
: