Target
Estrogen receptor beta
Ligand
BDBM50187243
Substrate
Meas. Tech.
ChEMBL_2074718 (CHEMBL4730252)
EC50
0.160000±n/a nM
Citation
 Wetzel, EAHanson, AMTroutfetter, CLBurkett, DJSem, DSDonaldson, WA Synthesis and evaluation of 17?-triazolyl and 9?-cyano derivatives of estradiol. Bioorg Med Chem 28:0 (2020)  
Target
Name:
Estrogen receptor beta
Synonyms:
ER-beta ESR2_HUMAN Estradiol receptor beta (ERβ) Estrogen receptor (ER beta) Estrogen receptor beta (ER beta) NR3A2 estrogen beta
Type:
Protein
Mol. Mass.:
59238.43
Organism:
Homo sapiens (Human)
Description:
Q92731
Residue:
530
  
Inhibitor
Name:
BDBM50187243
Synonyms:
17-ethinyl-3,17-estradiol 17-ethinylestradiol 17alpha-ethynylestra-1,3,5(10)-triene-3,17beta-diol CHEMBL691 Ethinylestradiol ethinyloestradiol
Type:
Small organic molecule
Emp. Form.:
C20H24O2
Mol. Mass.:
296.4034
SMILES:
C[C@]12CC[C@H]3[C@@H](CCc4cc(O)ccc34)[C@@H]1CC[C@@]2(O)C#C
: