Target
Kinesin-like protein KIF18A
Ligand
BDBM50561744
Substrate
Meas. Tech.
ChEMBL_2075814 (CHEMBL4731348)
IC50
14±n/a nM
Citation
 Sabnis, RW Novel KIF18A Inhibitors for Treating Cancer. ACS Med Chem Lett 11:2079-2080 (2020)  
Target
Name:
Kinesin-like protein KIF18A
Synonyms:
KI18A_HUMAN Kinesin-like protein KIF18A Marrow stromal KIF18A
Type:
PROTEIN
Mol. Mass.:
102320.22
Organism:
Homo sapiens
Description:
ChEMBL_119153
Residue:
898
  
Inhibitor
Name:
BDBM50561744
Synonyms:
CHEMBL4752657
Type:
Small organic molecule
Emp. Form.:
C25H31F3N4O5S
Mol. Mass.:
556.598
SMILES:
C[C@@H](CO)S(=O)(=O)Nc1ccc(C(=O)Nc2cccc(OCCC(F)(F)F)n2)c(c1)N1CCC2(CC2)CC1
: