Target
Serine protease 1
Ligand
BDBM50124984
Substrate
Meas. Tech.
ChEBML_213041
IC50
0.800000±n/a nM
Citation
 Huang, WNaughton, MAYang, HSu, TDam, SWong, PWArfsten, AEdwards, SSinha, UHollenbach, SScarborough, RMZhu, BY Design, synthesis, and structure-activity relationships of unsubstituted piperazinone-based transition state factor Xa inhibitors. Bioorg Med Chem Lett 13:723-8 (2003)  
Target
Name:
Serine protease 1
Synonyms:
Alpha-trypsin chain 1 Beta-trypsin PRSS1 TRP1 TRY1_HUMAN Thrombin & trypsin Trypsin I | Trypsin-1
Type:
Enzyme
Mol. Mass.:
26557.80
Organism:
Homo sapiens (Human)
Description:
P07477
Residue:
247
  
Inhibitor
Name:
BDBM50124984
Synonyms:
(R)-5-Guanidino-2-phenylmethanesulfonylamino-pentanoic acid {[(R)-4-guanidino-1-(thiazole-2-carbonyl)-butylcarbamoyl]-methyl}-amide | CHEMBL352039
Type:
Small organic molecule
Emp. Form.:
C24H36N10O5S2
Mol. Mass.:
608.737
SMILES:
NC(=N)NCCC[C@@H](NS(=O)(=O)Cc1ccccc1)C(=O)NCC(=O)N[C@H](CCCNC(N)=N)C(=O)c1nccs1
: